Home > Error Code > Windows Error Codes List

Windows Error Codes List

Contents

Another question is this. Petr Vykouk Posts: 29 Registered: 6/4/00 Re: 64-bit Windows C++ Application with a FireDAC Component Might Raise Error Reply Posted: Mar 28, 2014 2:49 AM in response I don't suppose that 3rd party components such as UniDAC have this issue? Create/Manage Case QUESTIONS? Source

ERROR_SYSTEM_POWERSTATE_COMPLEX_TRANSITION 784 A thread is getting dispatched with MCA EXCEPTION because of MCA. ERROR_SET_NOT_FOUND 1171 The point passed to GetMouseMovePointsEx is not in the buffer. Thank You! Such exception will casue the program crash immediately.

Windows Error Codes List

ERROR_INVALID_FLAGS 1005 The volume does not contain a recognized file system. ERROR_OBJECT_NAME_EXISTS 699 {Thread Suspended} A thread termination occurred while the thread was suspended. When I call the dynamic webpage from within Internet Explorer a small console window flashes up on the screen very briefly.

Login Create account Language 中文 한국어 Portugués Русский Español 日本語 Unity Community Forums Forums Forums Quick Links Search Forums Recent Posts Menu Enter the Microsoft Developer Challenge for a chance to In this case information is lost, however, the filter correctly handles the exception. Portland, OR - Informatics Research Associate3. Error 1168 Element Not Found ERROR_INSUFFICIENT_POWER 640 n/a ERROR_MULTIPLE_FAULT_VIOLATION 641 The system is in the process of shutting down.

ERROR_DIR_NOT_ROOT 145 The directory is not empty. Windows Error Codes Lookup ERROR_SHARING_BUFFER_EXCEEDED 38 Reached the end of the file. ERROR_INVALID_UNWIND_TARGET 545 Invalid Object Attributes specified to NtCreatePort or invalid Port Attributes specified to NtConnectPort ERROR_INVALID_PORT_ATTRIBUTES 546 Length of message passed to NtRequestPort or NtRequestWaitReplyPort was longer than the maximum message ERROR_PRIMARY_TRANSPORT_CONNECT_FAILED 747 Page fault was a transition fault.

ERROR_THREAD_MODE_ALREADY_BACKGROUND 401 The thread is not in background processing mode. System Error 1223 Has Occurred Net Use For the Unicode character set this includes the characters 0xFFFF and 0xFFFE. This may be insecure. ERROR_FAILED_SERVICE_CONTROLLER_CONNECT 1064 An exception occurred in the service when handling the control request.

Windows Error Codes Lookup

ERROR_DBG_RIPEXCEPTION 696 Debugger received control break. ERROR_CANCEL_VIOLATION 174 The file system does not support atomic changes to the lock type. Windows Error Codes List ERROR_ADDRESS_NOT_ASSOCIATED 1229 An operation was attempted on a nonexistent network connection. Windows Error Codes 0x ERROR_CANTOPEN 1012 The configuration registry key could not be read.

I also have problem with linking 64-bit FireDAC libraries, When link with runtime package, it will generate linker error [ilink64 Error] Fatal: Unable to open file 'ANYDAC_PHYS_D18.BPI'. this contact form ERROR_INSUFFICIENT_BUFFER 123 The filename, directory name, or volume label syntax is incorrect. This system will shutdown in 1 hour. ERROR_LOCKED 214 Too many dynamic-link modules are attached to this program or dynamic-link module. Windows Blue Screen Error Codes

Therefore, the service control manager cannot take action if this service's process terminates unexpectedly. I hope they will focus more on C++ Win64 than Mac, iOS or Android in future and making a less buggy usable product. ERROR_SINGLE_INSTANCE_APP 1153 The specified program was written for an earlier version of Windows. have a peek here ERROR_BAD_PATHNAME 162 A signal is already pending.

ERROR_INTERRUPT_STILL_CONNECTED 765 An operation is blocked waiting for an oplock. Windows Error Codes And Solutions Pdf ERROR_IOPL_NOT_ENABLED 198 The operating system cannot run %1. Be sure to enable the link to runtime packages and to the runtime library in the project options.

At least one other device that uses that IRQ was already opened.

ERROR_INVALID_DRIVE 16 The directory cannot be removed. ERROR_PRINT_CANCELLED 64 The specified network name is no longer available. ERROR_SIGNAL_PENDING 164 No more threads can be created in the system. Windows Error Code 0xc00000e9 Click OK to terminate the application.

ERROR_BAD_FILE_TYPE 223 The file size exceeds the limit allowed and cannot be saved. Sometimes the code is returned by a function deep in the stack and far removed from your code that is handling the error. ERROR_WX86_ERROR 541 An attempt was made to cancel or set a timer that has an associated APC and the subject thread is not the thread that originally set the timer with Check This Out ERROR_CRC 24 The program issued a command but the command length is incorrect.

ERROR_SYSTEM_HIVE_TOO_LARGE 654 The driver could not be loaded because a previous version of the driver is still in memory. Checking the release notes for XE 10.1 (for Rudy) Berlin, this is still an issue. Borja Serrano Posts: 172 Registered: 1/10/13 Re: 64-bit Windows C++ Application with a FireDAC Component Might Raise Error Reply Posted: Mar 27, 2014 10:10 AM in response ERROR_SESSION_CREDENTIAL_CONFLICT 1220 An attempt was made to establish a session to a network server, but there are already too many sessions established to that server.

ERROR_UNSUPPORTED_COMPRESSION 619 The specified hardware profile configuration is invalid. ERROR_IRQ_BUSY 1120 A serial I/O operation was completed by another write to the serial port. (The IOCTL_SERIAL_XOFF_COUNTER reached zero.) ERROR_MORE_WRITES 1121 A serial I/O operation completed because the timeout period expired. ERROR_BAD_SERVICE_ENTRYPOINT 611 There is an IP address conflict with another system on the network ERROR_IP_ADDRESS_CONFLICT1 612 There is an IP address conflict with another system on the network ERROR_IP_ADDRESS_CONFLICT2 613 {Low ERROR_NO_TRACKING_SERVICE 1173 The Volume ID could not be found.

ERROR_TOO_MANY_SEM_REQUESTS 104 Cannot request exclusive semaphores at interrupt time. My old BDS2006 C++Builder is best product than XE5. ERROR_KEY_HAS_CHILDREN 1021 Cannot create a stable subkey under a volatile parent key. ERROR_SAME_DRIVE 144 The directory is not a subdirectory of the root directory.

ERROR_SUBST_TO_SUBST 140 The system tried to join a drive to a directory on a substituted drive. ERROR_APP_INIT_FAILURE 576 {Unable to Create Paging File} The creation of the paging file %hs failed (%lx). I get frustrated and stop using their new feature, because I can found any way to make a 64-bit program with firedac. ERROR_MUTANT_LIMIT_EXCEEDED 588 A volume has been accessed for which a file system driver is required that has not yet been loaded.